{"text_format":"1","workbook":"xlsx","n_sheets":11,"sheets":["Customer Information","Savings Calculations","Dryer Inputs and Calculations","Desiccant Dryer","Explanation of Inputs","Master Outputs","Cooling Fan VFD","Weather","Correction Factors","Operating Power","Instructions"],"not_rendered":{"charts":10,"images":19,"macros":1,"external_links":2,"defined_names":162,"comments":3,"pivot_tables":0},"unopened":[],"bounds":{"document_bytes":16777216,"sheet_cells":100000,"rows_first":2000,"rows_last":500,"rows_between":2000,"halvings":0,"cell_chars":16384,"cell_head_chars":4096},"cells_cut":0,"cells_raw":0,"read":"whole","date_system":"1900"}

{"sheet":"Customer Information","index":0,"n_rows":252,"n_cols":46,"rows_kept":252,"cut":false,"hidden":false,"merged":[[3,22,4,31],[7,18,7,27],[7,3,7,17],[22,16,22,24],[9,17,9,31],[11,25,11,27],[13,2,13,7],[9,3,9,16],[20,3,20,15],[7,28,7,31],[22,3,22,15],[13,8,13,13],[20,25,20,31],[13,14,13,22],[22,25,22,27],[22,28,22,31],[60,3,60,31],[30,21,30,31],[20,16,20,24],[11,17,11,24],[11,3,11,16],[26,3,26,11],[30,3,30,5],[35,3,35,14],[24,3,24,11],[24,12,24,20],[35,15,35,23],[30,12,30,14],[35,24,35,31],[11,28,11,31],[13,23,13,31]]}
[]
[null,false]
[]
[null,null,null,"BPA Small Compressed Air Calculator"]
[null,null,null,"and Incentive Funding Application Tool"]
[null,null,null,"PARTICIPANT INFORMATION"]
[null,null,null,"Company Name:",null,null,null,null,null,null,null,null,null,null,null,null,null,null,"Prepared by:",null,null,null,null,null,null,null,null,null,"Date:"]
[]
[null,null,null,"Contact:",null,null,null,null,null,null,null,null,null,null,null,null,null,"Title:"]
[]
{"$rows_left_out":243}
{"sheet":"Savings Calculations","index":1,"n_rows":141,"n_cols":106,"rows_kept":141,"cut":false,"hidden":false,"merged":[[70,4,70,5],[70,7,70,9],[75,21,75,23],[75,15,75,20],[74,7,74,9],[72,7,72,9],[73,7,73,9],[12,9,12,12],[17,9,17,11],[18,9,18,11],[19,9,19,11],[4,16,6,25],[12,15,12,16],[68,21,68,23],[45,12,45,14],[43,12,43,14],[44,21,44,23],[20,9,20,11],[21,9,21,11],[40,21,40,23],[67,21,67,23],[66,21,66,23],[22,9,22,11],[41,12,41,14],[23,9,23,11],[24,9,24,11],[40,12,40,14],[44,12,44,14],[25,9,25,11],[26,9,26,11],[31,9,31,11],[41,21,41,23],[42,12,42,14],[42,21,42,23],[110,84,120,84],[90,101,90,102],[106,85,106,94],[90,99,90,100],[75,7,75,9],[77,7,77,9],[77,15,77,20],[76,7,76,9],[76,21,76,23],[76,15,76,20],[119,105,119,113],[116,104,116,105],[118,105,118,113],[107,95,107,96],[109,86,109,94],[70,24,70,26],[69,24,69,26],[73,21,73,23],[126,77,126,78],[114,77,114,78],[125,77,125,78],[70,21,70,23],[125,75,125,76],[69,21,69,23],[77,21,77,23],[113,75,113,76],[113,77,113,78],[72,21,72,23],[72,24,72,26],[73,24,73,26],[66,7,66,9],[66,4,66,5],[44,9,44,11],[43,9,43,11],[45,9,45,11],[69,7,69,9],[45,4,45,5],[40,4,40,5],[40,9,40,11],[42,4,42,5],[42,9,42,11],[69,4,69,5],[68,7,68,9],[41,4,41,5],[44,4,44,5],[41,9,41,11],[67,4,67,5],[67,7,67,9],[43,4,43,5],[46,4,46,5],[68,4,68,5],[40,24,40,25],[42,24,42,25],[46,24,46,25],[43,21,43,23],[43,24,43,25],[45,21,45,23],[44,24,44,25],[41,24,41,25],[45,24,45,25]]}
[]
[]
[null,null,"ESTIMATE OF ENERGY SAVINGS AND INCENTIVES"]
[]
[null,null,null,"Customer:",{"$f":"IF(ISBLANK(CompanyName),\"\",CompanyName&\" – \" &SiteCity&\", \"&SiteState)","v":" – , "}]
[null,null,null,"Vendor:",{"$f":"VendorCompany","v":""}]
[]
[null,null,"SELECTION OF OPTIONAL MEASURES"]
[null,null,"Select all that apply:"]
[]
{"$rows_left_out":132}
{"sheet":"Dryer Inputs and Calculations","index":2,"n_rows":64,"n_cols":30,"rows_kept":64,"cut":false,"hidden":true,"merged":[[27,17,27,18],[31,5,31,6],[16,5,16,6],[16,7,16,10],[16,11,16,13],[20,5,20,6],[20,8,20,9],[63,13,63,14],[13,5,13,6],[13,8,13,9],[24,5,24,6],[25,5,25,6],[26,5,26,6],[27,5,27,6],[33,2,34,5],[10,5,10,6],[10,8,10,9],[7,1,7,2],[8,5,8,7],[8,8,8,10],[9,4,9,6],[9,8,9,11]]}
[]
[]
[null,null,"ENERGY SAVINGS CALCULATOR FOR CYCLING REFRIGERATED AIR DRYERS"]
[null,null,null,"Customer:",{"$f":"IF(ISBLANK(CompanyName),\"\",CompanyName&\":  \" &SiteCity&\", \"&SiteState)","v":":  , "}]
[null,null,null,"Vendor:",{"$f":"VendorCompany","v":""}]
[]
[null,null," INFORMATION ABOUT THE AIR DRYERS"]
[]
[null,null,null,null,null,"    Baseline Dryer",null,null,"    Proposed Dryer"]
[null,null,"Type of air dryer:",null,"Air-cooled non-cycling",null,null,null,"Air-cooled cycling"]
{"$rows_left_out":55}
{"sheet":"Desiccant Dryer","index":3,"n_rows":80,"n_cols":30,"rows_kept":80,"cut":false,"hidden":true,"merged":[[10,5,10,6],[10,8,10,9],[7,1,7,2],[8,5,8,7],[8,8,8,10],[9,5,9,6],[9,8,9,9],[11,5,11,6],[11,8,11,9],[12,5,12,6],[12,8,12,9],[13,5,13,6],[13,8,13,9],[29,5,29,6],[15,2,15,4],[16,5,16,6],[16,8,16,9],[17,5,17,6],[17,8,17,9],[20,5,20,6],[20,7,20,10],[20,11,20,13],[24,5,24,6],[24,8,24,9],[27,17,27,18],[28,5,28,6],[48,6,48,7],[48,8,48,9],[48,10,48,11],[48,12,48,13],[30,5,30,6],[31,5,31,6],[35,2,36,5],[46,6,46,7],[46,8,46,9],[46,10,46,11],[46,12,46,13],[47,6,47,7],[47,8,47,9],[47,10,47,11],[47,12,47,13],[56,6,56,7],[56,9,56,10],[56,11,56,12],[49,6,49,7],[49,8,49,9],[49,10,49,11],[49,12,49,13],[50,6,50,7],[50,8,50,9],[50,10,50,11],[50,12,50,13],[51,6,51,7],[51,8,51,9],[51,10,51,11],[51,12,51,13],[52,12,52,13],[57,6,57,7],[57,9,57,10],[57,11,57,12],[58,6,58,7],[58,9,58,10],[58,11,58,12],[61,6,61,7],[61,9,61,10],[61,11,61,12],[59,6,59,7],[59,9,59,10],[59,11,59,12],[60,6,60,7],[60,9,60,10],[60,11,60,12]]}
[]
[]
[null,null,"ENERGY SAVINGS CALCULATOR FOR DESICCANT AIR DRYERS"]
[null,null,null,"Customer:",{"$f":"IF(ISBLANK(CompanyName),\"\",CompanyName&\":  \" &SiteCity&\", \"&SiteState)","v":":  , "},null,null,null,null,null,null,null,null,null,null,null,null,null,null,"indoors"]
[null,null,null,"Vendor:",{"$f":"VendorCompany","v":""},null,null,null,null,null,null,null,null,null,null,null,{"$f":"SiteState","v":""},null,null,"outdoors"]
[]
[null,null," INFORMATION ABOUT THE AIR DRYERS"]
[null,null,null,null,null,null,null,null,null,null,null,null,null,null,null,null,null,null,null,"Dryer Types","Default Purge Rate"]
[null,null,null,null,null,"    Baseline Dryer",null,null,"    Proposed Dryer",null,null,null,null,null,null,null,null,null,null,"Heatless",0.15]
[null,null,"Type of air dryer:",null,null,null,null,null,null,null,null,null,null,null,null,null,null,null,null,"Heated Purge",7.4999999999999997E-2]
{"$rows_left_out":71}
{"sheet":"Explanation of Inputs","index":4,"n_rows":179,"n_cols":46,"rows_kept":179,"cut":false,"hidden":false,"merged":[[18,4,29,30],[34,4,45,30],[50,28,50,30],[59,28,59,30],[67,28,67,30],[64,11,64,27],[51,28,51,30],[50,5,50,10],[50,11,50,27],[58,28,58,30],[57,5,57,10],[58,5,58,10],[59,5,59,10],[60,5,60,10],[61,5,61,10],[62,5,62,10],[68,28,68,30],[60,28,60,30],[61,28,61,30],[62,28,62,30],[63,28,63,30],[64,28,64,30],[65,28,65,30],[66,28,66,30],[70,11,70,27],[69,28,69,30],[70,28,70,30],[71,28,71,30],[72,28,72,30],[72,7,72,9],[72,10,72,12],[72,13,72,15],[72,16,72,18],[71,11,71,27],[72,25,72,27],[72,19,72,21],[72,22,72,24],[73,4,74,30],[4,22,6,30],[56,28,56,30],[57,28,57,30],[54,28,54,30],[55,28,55,30],[52,28,52,30],[53,28,53,30],[10,4,13,30],[51,5,51,10],[52,5,52,10],[53,5,53,10],[54,5,54,10],[55,5,55,10],[56,5,56,10],[68,5,68,10],[57,11,57,27],[63,5,63,10],[64,5,64,10],[65,5,65,10],[66,5,66,10],[67,5,67,10],[63,11,63,27],[66,11,66,27],[67,11,67,27],[69,5,69,10],[70,5,70,10],[71,5,71,10],[51,11,51,27],[52,11,52,27],[53,11,53,27],[54,11,54,27],[55,11,55,27],[56,11,56,27],[65,11,65,27],[68,11,68,27],[69,11,69,27],[58,11,58,27],[59,11,59,27],[60,11,60,27],[61,11,61,27],[62,11,62,27]]}
[]
[null,false]
[]
[null,null,null," EXPLANATION OF INPUTS"]
[null,null,null,null,null,null,"Customer:",null,{"$f":"IF(ISBLANK(CompanyName),\"\",CompanyName&\":  \" &SiteCity&\", \"&SiteState)","v":":  , "}]
[null,null,null,null,null,null,"Vendor:",null,{"$f":"VendorCompany","v":""}]
[]
[null,null,null," HOURS OF OPERATION"]
[null,null,null," Please explain how the hours of operation was determined"]
[]
{"$rows_left_out":170}
{"sheet":"Master Outputs","index":5,"n_rows":288,"n_cols":17,"rows_kept":288,"cut":false,"hidden":true,"merged":[[90,4,90,5],[38,7,38,8],[38,1,38,2],[38,3,38,4],[38,5,38,6],[60,6,66,6]]}
["ASSEMBLY AREA FOR VALUES TO BE TRANSFERRED TO OUTPUT SHEETS, FORMS, AND APPLICATION TEMPLATES"]
["Participant Information","Values Transferred","Range Names",null,null,null,null,null,null,null,"Choices for Business Type:"]
["Contact Name:",{"$f":"IF('Customer Information'!D10=0,\"\",'Customer Information'!D10)","v":""},"ContactName",null,"orange type","VBA inserts the value",null,null,null,null,"Agriculture, Forestry, Fishing and Hunting",1,null,null,"Revision History"]
["Last Name:",{"$f":"IF(ISERR(FIND(\" \",ContactName,1+FIND(\" \",ContactName))),MID(ContactName,FIND(\" \",ContactName)+1,LEN(ContactName)),MID(ContactName,1+FIND(\" \",ContactName,1+FIND(\" \",ContactName)),LEN(ContactName)))","v":{"$error":"#VALUE!"}},"LastName",null,"blue type","the cell has undergone a special intermediary formatting step",null,null,null,null,"     Crop Production",null,null,null,"V2.00",null,"Initial Release"]
["Title:",{"$f":"IF($L$3=2,\"Ms.\",\"Mr.\")","v":"Mr."},"ContactGender",null,"violet type","the cell is hard coded",null,null,null,null,"           Greenhouse",null,null,null,"V2.01","2009-06-12","Fixed C/E checker cell B203"]
["Title:",{"$f":"IF('Customer Information'!R10=0,\"\",'Customer Information'!R10)","v":""},"Title",null,"green background","cell is a named range filled by copying a value from the tool",null,null,null,null,"           Field Crops",null,null,null,"V2.01","2009-06-12","Merged cells for explanation of Inputs field"]
["Company Name:",{"$f":"IF('Customer Information'!D8=0,\"\",'Customer Information'!D8)","v":""},"CompanyName",null,"orange type","cell is named range filled by VBA in tool",null,null,null,null,"           Indoor Agriculture",null,null,null,"V2.01","2009-06-12","Created print area around C/E checker"]
["Mailing Address:",{"$f":"IF('Customer Information'!D12=0,\"\",'Customer Information'!D12)","v":""},"MailStreet",null,"grey background","cell is named range filled by calculation - used by DocMaker, common to all tools",null,null,null,null,"     Animal Production and Aquaculture",null,null,null,"V2.01","2009-06-12","Changed many fields that reported \"0\" to \"\""]
["City:",{"$f":"IF('Customer Information'!R12=0,\"\",'Customer Information'!R12)","v":""},"MailCity",null,"no background","cell is used for interim calculations - tool specific may be named or unnamed",null,null,null,null,"     Forestry and Logging",null,null,null,"V2.01","2009-06-12","Fixed format on Estimated Energy Savings to \"#,###\""]
["State:",{"$f":"IF('Customer Information'!Z12=0,\"\",'Customer Information'!Z12)","v":""},"MailState",null,"yellow background","cell is hand entered every time",null,null,null,null,"     Support Activities for Agriculture and Forestry",null,null,null,"V2.01","2009-06-16","Fixed fix of 12 June - Company Name was referencing Contact when blank"]
{"$rows_left_out":279}
{"sheet":"Cooling Fan VFD","index":6,"n_rows":40,"n_cols":10,"rows_kept":40,"cut":false,"hidden":true,"merged":[]}
[]
[]
[]
[]
[]
[]
[null,null,"Assumptions:",null,null,null,null,"Baseline"]
[null,null,"Baseline Fan motor hp:",{"$f":"'Savings Calculations'!J32","v":2},"hp"]
[null,null,"Upgrade fan motor hp:",{"$f":"'Savings Calculations'!P32","v":2},"hp",null,null,"run hours:",{"$f":"SUM('Savings Calculations'!E42:F45)","v":0},"hrs"]
[null,null,"Estimated load factor:",0.85,null,null,null,"Power:",{"$f":"D8*0.746*D10/D12","v":1.4930983240695197},"kW"]
{"$rows_left_out":31}
{"sheet":"Weather","index":7,"n_rows":493,"n_cols":6,"rows_kept":493,"cut":false,"hidden":true,"merged":[]}
[null,"Location","Season","Shift","Bin","DB °F"]
[{"$f":"IF(B2=B1,\"\",B2)","v":"OR - Astoria"},"OR - Astoria","winter",1,1,48.875250000000008]
[{"$f":"IF(B3=B2,\"\",B3)","v":""},"OR - Astoria","winter",2,2,45.497999999999962]
["","OR - Astoria","winter",3,3,41.78399999999997]
["","OR - Astoria","spring",1,4,57.168351648351546]
["","OR - Astoria","spring",2,5,52.496263736263735]
["","OR - Astoria","spring",3,6,49.040412087912166]
["","OR - Astoria","summer",1,7,65.062038043478324]
["","OR - Astoria","summer",2,8,59.470054347826142]
["","OR - Astoria","summer",3,9,55.695679347826065]
{"$rows_left_out":484}
{"sheet":"Correction Factors","index":8,"n_rows":89,"n_cols":22,"rows_kept":89,"cut":false,"hidden":true,"merged":[]}
[null,null,null,"Correction factors for compressed air refrigerated dryers"]
[]
[null,null,null,"CORRECTION FACTOR FOR DRYER INLET AIR TEMPERATURE",null,null,null,null,null,null,"CORRECTION FACTOR FOR INLET AIR PRESSURE",null,null,null,null,null,null,"CORRECTION FACTOR FOR AMBIENT AIR TEMPERATURE"]
[]
[null,null,null,"Inlet air","Correction",null,null,null,null,null,"Inlet air","Correction",null,null,null,null,null,"Ambient","Correction"]
[null,null,null,"temp","factor",null,null,null,null,null,"pressure","factor",null,null,null,null,null,"temp","factor"]
[null,null,null,80,{"$f":"AVERAGE(F26,E37,E65)","v":1.5931147540983606},null,{"$f":"D7","v":80},{"$f":"G7^2","v":6400},{"$f":"G7^3","v":512000},null,50,{"$f":"AVERAGE(M26,L65)","v":0.78759689922480614},null,{"$f":"K7","v":50},{"$f":"N7^2","v":2500},{"$f":"N7^3","v":125000},null,80,{"$f":"AVERAGE(T26,S37,T49)","v":1.2066666666666668}]
[null,"averaged",null,90,{"$f":"AVERAGE(F27,E38,E66)","v":1.2519409282700422},null,{"$f":"D8","v":90},{"$f":"G8^2","v":8100},{"$f":"G8^3","v":729000},null,75,{"$f":"AVERAGE(M27,M37,L66)","v":0.90636363636363637},null,{"$f":"K8","v":75},{"$f":"N8^2","v":5625},{"$f":"N8^3","v":421875},null,90,{"$f":"AVERAGE(T27,S38,T50)","v":1.1011985018726593}]
[null,null,null,100,{"$f":"AVERAGE(F28,E39,E67)","v":1},null,{"$f":"D9","v":100},{"$f":"G9^2","v":10000},{"$f":"G9^3","v":1000000},null,100,{"$f":"AVERAGE(L28,N38,M67)","v":1},null,100,10000,1000000,null,100,{"$f":"AVERAGE(T28,S39,T51)","v":1}]
[null,null,null,110,{"$f":"AVERAGE(F29,E40,E68)","v":0.81766937669376694},null,{"$f":"D10","v":110},{"$f":"G10^2","v":12100},{"$f":"G10^3","v":1331000},null,125,{"$f":"AVERAGE(M29,M39,L68)","v":1.0875968992248064},null,125,15625,1953125,null,110,{"$f":"AVERAGE(T29,S40,T52)","v":0.88735632183908042}]
{"$rows_left_out":80}
{"sheet":"Operating Power","index":9,"n_rows":146,"n_cols":38,"rows_kept":146,"cut":false,"hidden":true,"merged":[]}
[null,"Operating Power: Cycling and Non-Cycling"]
[]
[]
[null,"Cycling"]
[null,"Air cooled",null,null,null,null,null,null,null,null,null,null,null,null,null,null,"Water Cooled"]
[null,"Nominal","operating",null,null,null,null,null,null,null,null,null,null,null,null,null,"Nominal","operating",null,null,null,null,null,null,null,null,null,null,null,null,null,"Ingersoll-Rand data"]
[null,"capacity,","kW",null,null,null,null,null,null,null,null,null,null,null,null,null,"capacity,","kW",null,null,null,null,null,null,"Non-cycling Dryer Part Load Performance",null,null,null,null,null,null,"model","full flow","10% flow","full power","10% power","%power at 10% flow"]
[null,"scfm @ 38F","air cool",null,null,"sorted","averaged",null,null,null,null,null,null,null,null,null,"scfm @ 38F","water cool",null,null,"sorted","averaged",null,null,null,null,null,null,null,null,null,"D340IN",200,20,1.7,1.6,{"$f":"AJ8/AI8","v":0.94117647058823539}]
[null,75,0.78,"Zek",null,20,0.26,null,null,null,null,null,null,null,null,null,0,0,"Hankinson",null,100,1,null,null,"% load","% rated power",null,null,null,null,null,"D420IN",250,25,1.8,1.7,{"$f":"AJ9/AI9","v":0.94444444444444442}]
[null,80,0.71,"Sullivan",null,75,0.78,null,null,null,null,null,null,null,null,null,200,1.06,"Zek",null,200,1.06,null,null,1,1,null,null,null,null,null,"D510IN",300,30,2.2000000000000002,2.1,0.95454545454545447]
{"$rows_left_out":137}
{"sheet":"Instructions","index":10,"n_rows":24,"n_cols":4,"rows_kept":24,"cut":false,"hidden":false,"merged":[]}
[]
[]
[]
[]
[null,null,"Instructions for Using the BPA Small Compressed Air Calculator"]
[null,null,"Intended Use"]
[null,null,"The BPA Small Compressed Air Calculator provides a means of quickly estimating air compressor energy use and the savings associated with changing to a different compressor or compressor control method.  The output may be used to apply for incentive funding from utility efficiency programs for projects involving compressors 150 hp and below.  (Larger projects usually require a custom study.)  Call the energy efficiency department at your local electric utility for information on incentives and details on how to apply.   "]
[null,null,"General Instructions"]
[null,null,"Input fields are located on three worksheets in this Excel file.  Information about the customer, also called the program \"Participant\", is entered in the first tab; \"Customer Information.\"  Vendor contact information and utility incentive program details are also entered here.  Technical information about the project is requested on the second tab; \"Savings Calculations.\"  The third tab, \"Explanation of Inputs,\" asks for explanation of how some of the entries in \"Savings Calculations\" were derived.   A summary of results appears at the bottom of the \"Savings Calculations\" tab."]
[null,null,"Baseline Determination Considerations"]
{"$rows_left_out":14}